����,����[��],�|���v��[��],�^���N��[��],�~���H���[��],�͂�����[��],��^����������[��],��^���w��[��],�A���t������[��],���w��[��],�w����[��],����ЊQ�Ή���[��],���_�@�\�`����[��],���ʍ��x�H���[��],��^�����V�X�e�����ڎ�[��],�C�����p�^���h�����V�X�e��[��],�Ôg�E��K�͕����Q�΍�ԗ�[��],�w�ߍL���[��],�l���A����[��],���@�ޔ�����[��],���K�i�~�}��[��],�~�}��[��],�\�h���@��[��],�h�Ύw����[��],�L��w����[��],�A����[��],���h��[��]
����,178,27,19,9,7,1,1,1,6,8,1,1,1,1,2,1,16,1,6,33,,27,3,1,4,1
���h��,15,,,1,,,,,,,1,,,,,,5,,,3,,3,,1,1,
�k���h���{��,13,2,1,1,,1,1,,,1,,,,,,,1,,1,2,,1,1,,,
�k���h�����l�o����,4,1,,,,,,,1,,,,,,,,,,,1,,1,,,,
�k���h�����v,17,3,1,1,,1,1,,1,1,,,,,,,1,,1,3,,2,1,,,
�����h���{��,11,1,,1,1,,,,,1,,,,,,1,2,,1,1,,1,,,1,
�����h���R�̉��o����,5,1,,,,,,1,1,,,,,,,,,,,1,,1,,,,
�����h����`�O�o����,2,,1,,,,,,1,,,,,,,,,,,,,,,,,
�����h����`�o����,4,1,1,,,,,,,,,,,,,,,,,1,,1,,,,
�����h�����v,22,3,2,1,1,,,1,2,1,,,,,,1,2,,1,3,,3,,,1,
�������h���{��,9,1,1,,,,,,,1,,1,,,,,1,,1,,,1,1,,1,
�������h���b�o����,4,,1,,,,,,,,,,,,,,,,,1,,1,,,,1
�������h�����R�Y�o����,2,,1,,,,,,,,,,,,,,,,,,,1,,,,
�������h�����D�o����,2,,1,,,,,,,,,,,,,,,,,,,1,,,,
�������h�������O�o����,3,1,,,,,,,1,,,,,,,,1,,,,,,,,,
�������h�������o����,2,,,,,,,,,,,,,,,,,,,1,,1,,,,
�������h���������o����,3,1,1,,,,,,,,,,,,,,,,,,,1,,,,
�������h�������o����,3,,,1,1,,,,,,,,,,,,,,,,,1,,,,
�������h���w��o����,4,,1,,,,,,,,,,,,,,,,,2,,1,,,,
�������h���R���o����,4,1,1,,,,,,,,,,,,,,,,,1,,1,,,,
�������h�����v,36,4,7,1,1,,,,1,1,,1,,,,,2,,1,5,,9,1,,1,1
�]����h���{��,9,1,1,1,1,,,,,1,,,,,,,2,,,1,,1,,,,
�]����h�����z�o����,4,1,,,,,,,,,,,,,,,,,,2,,1,,,,
�]����h�����v,13,2,1,1,1,,,,,1,,,,,,,2,,,3,,2,,,,
�H�t���h���{��,12,1,,1,1,,,,1,1,,,,,2,,1,1,1,1,,1,,,,
�H�t���h���k��o����,3,2,,,,,,,,,,,,,,,,,,1,,,,,,
�H�t���h�����{�ˏo����,3,1,1,,,,,,,,,,,,,,,,,1,,,,,,
�H�t���h�����v,18,4,1,1,1,,,,1,1,,,,,2,,1,1,1,3,,1,,,,
����h���{��,11,2,,1,1,,,,,1,,,,1,,,1,,,2,,1,1,,,
����h���k���o����,2,,1,,,,,,,,,,,,,,,,,1,,,,,,
����h�����v,13,2,1,1,1,,,,1,1,,,,1,,,1,,,3,,1,1,,,
�����h���{��,9,1,,1,1,,,,,1,,,,,,,1,,1,1,,1,,,1,
�����h�����j�o����,4,1,,,,,,,,,,,1,,,,,,,1,,1,,,,
�����h�������o����,4,1,1,,,,,,,,,,,,,,,,,1,,1,,,,
�����h���Ԓˏo����,3,1,1,,,,,,,,,,,,,,,,,,,1,,,,
�����h������o����,3,,1,,,,,,,,,,,,,,,,,1,,1,,,,
�����h�����v,23,4,3,1,1,,,,,1,,,1,,,,1,,1,4,,5,,,1,
�������h���{��,11,1,1,1,1,,,,1,1,,,,,,,1,,1,2,,1,,,,
�������h���⎺�o����,3,1,1,,,,,,,,,,,,,,,,,1,,,,,,
�������h�������o����,2,1,,,,,,,,,,,,,,,,,,1,,,,,,
�������h�����V���o����,2,1,,,,,,,,,,,,,,,,,,1,,,,,,
�������h������o����,3,1,1,,,,,,,,,,,,,,,,,1,,,,,,
�������h�����v,21,5,3,1,1,,,,1,1,,,,,,,1,,1,6,,1,,,,
